{"text_format":"2","workbook":"xlsx","n_sheets":6,"sheets":["Program Fredag","Kvinder 2x4","Oldgirls 1x5","Oldboys 1x4","Veteraner 1x5","Herrer 4x4"],"not_rendered":{"charts":0,"images":0,"macros":0,"external_links":0,"defined_names":0,"comments":0,"pivot_tables":0},"unopened":[],"bounds":{"document_bytes":16777216,"sheet_cells":100000,"run_cost":"one","rows_first":2000,"rows_last":500,"rows_between":2000,"halvings":0,"cell_chars":16384,"cell_head_chars":4096},"cells_cut":0,"cells_raw":0,"read":"whole","date_system":"1900"}

{"sheet":"Program Fredag","index":0,"n_rows":91,"n_cols":8,"rows_kept":91,"cut":false,"hidden":false,"merged":[[78,4,78,6],[30,4,30,6],[44,4,44,6],[39,4,39,6],[47,4,47,6],[1,4,1,6],[52,4,52,6],[49,4,49,6],[75,4,75,6],[21,4,21,6]]}
["Fredag 05.01.2018 - NY HAL",null,null,"NH"]
["Kl.","Kamp","Årgang","Pulje","Hold",null,null,"Løbenummer"]
["18:00:00",{"$f":"CONCATENATE(H3,\"-\",$D$1)","v":"1-NH"},{"$f":"'Kvinder 2x4'!C43","v":"Kvinder"},{"$f":"'Kvinder 2x4'!D43","v":"Kvinder-1"},{"$f":"'Kvinder 2x4'!E43","v":"Hvalsø 1"},{"$f":"'Kvinder 2x4'!F43","v":"-"},{"$f":"'Kvinder 2x4'!G43","v":"Hvalsø 2"},1]
[null,"2-NH",{"$f":"'Kvinder 2x4'!C44","v":"Kvinder"},{"$f":"'Kvinder 2x4'!D44","v":"Kvinder-2"},{"$f":"'Kvinder 2x4'!E44","v":"Hvalsø 3"},{"$f":"'Kvinder 2x4'!F44","v":"-"},{"$f":"'Kvinder 2x4'!G44","v":"Hvalsø 4"},2]
["18:15:00","3-NH",{"$f":"'Kvinder 2x4'!C45","v":"Kvinder"},{"$f":"'Kvinder 2x4'!D45","v":"Kvinder-1"},{"$f":"'Kvinder 2x4'!E45","v":"TBK"},{"$f":"'Kvinder 2x4'!F45","v":"-"},{"$f":"'Kvinder 2x4'!G45","v":"Kr. Hyllinge"},3]
[null,"4-NH",{"$f":"'Kvinder 2x4'!C46","v":"Kvinder"},{"$f":"'Kvinder 2x4'!D46","v":"Kvinder-2"},{"$f":"'Kvinder 2x4'!E46","v":"Team Susanne"},{"$f":"'Kvinder 2x4'!F46","v":"-"},{"$f":"'Kvinder 2x4'!G46","v":"FC Lejre"},4]
["18:30:00","5-NH",{"$f":"'Kvinder 2x4'!C47","v":"Kvinder"},{"$f":"'Kvinder 2x4'!D47","v":"Kvinder-1"},{"$f":"'Kvinder 2x4'!E47","v":"Hvalsø 1"},{"$f":"'Kvinder 2x4'!F47","v":"-"},{"$f":"'Kvinder 2x4'!G47","v":"TBK"},5]
[null,"6-NH",{"$f":"'Kvinder 2x4'!C48","v":"Kvinder"},{"$f":"'Kvinder 2x4'!D48","v":"Kvinder-2"},{"$f":"'Kvinder 2x4'!E48","v":"Hvalsø 3"},{"$f":"'Kvinder 2x4'!F48","v":"-"},{"$f":"'Kvinder 2x4'!G48","v":"Team Susanne"},6]
["18:45:00","7-NH",{"$f":"'Kvinder 2x4'!C49","v":"Kvinder"},{"$f":"'Kvinder 2x4'!D49","v":"Kvinder-1"},{"$f":"'Kvinder 2x4'!E49","v":"Hvalsø 2"},{"$f":"'Kvinder 2x4'!F49","v":"-"},{"$f":"'Kvinder 2x4'!G49","v":"Kr. Hyllinge"},7]
[null,"8-NH",{"$f":"'Kvinder 2x4'!C50","v":"Kvinder"},{"$f":"'Kvinder 2x4'!D50","v":"Kvinder-2"},{"$f":"'Kvinder 2x4'!E50","v":"Hvalsø 4"},{"$f":"'Kvinder 2x4'!F50","v":"-"},{"$f":"'Kvinder 2x4'!G50","v":"FC Lejre"},8]
["19:00:00","9-NH",{"$f":"'Kvinder 2x4'!C51","v":"Kvinder"},{"$f":"'Kvinder 2x4'!D51","v":"Kvinder-1"},{"$f":"'Kvinder 2x4'!E51","v":"Kr. Hyllinge"},{"$f":"'Kvinder 2x4'!F51","v":"-"},{"$f":"'Kvinder 2x4'!G51","v":"Hvalsø 1"},9]
[null,"10-NH",{"$f":"'Kvinder 2x4'!C52","v":"Kvinder"},{"$f":"'Kvinder 2x4'!D52","v":"Kvinder-2"},{"$f":"'Kvinder 2x4'!E52","v":"FC Lejre"},{"$f":"'Kvinder 2x4'!F52","v":"-"},{"$f":"'Kvinder 2x4'!G52","v":"Hvalsø 3"},10]
["19:15:00","11-NH",{"$f":"'Kvinder 2x4'!C53","v":"Kvinder"},{"$f":"'Kvinder 2x4'!D53","v":"Kvinder-1"},{"$f":"'Kvinder 2x4'!E53","v":"Hvalsø 2"},{"$f":"'Kvinder 2x4'!F53","v":"-"},{"$f":"'Kvinder 2x4'!G53","v":"TBK"},11]
[null,"12-NH",{"$f":"'Kvinder 2x4'!C54","v":"Kvinder"},{"$f":"'Kvinder 2x4'!D54","v":"Kvinder-2"},{"$f":"'Kvinder 2x4'!E54","v":"Hvalsø 4"},{"$f":"'Kvinder 2x4'!F54","v":"-"},{"$f":"'Kvinder 2x4'!G54","v":"Team Susanne"},12]
["19:30:00","13-NH",{"$f":"'Oldboys 1x4'!A25","v":"Oldboys"},{"$f":"'Oldboys 1x4'!B25","v":"Oldboys-1"},{"$f":"'Oldboys 1x4'!C25","v":"Såby"},{"$f":"'Oldboys 1x4'!D25","v":"-"},{"$f":"'Oldboys 1x4'!E25","v":"Hvalsø 1"},13]
[null,"14-NH",{"$f":"'Kvinder 2x4'!C55","v":"Kvinder"},{"$f":"'Kvinder 2x4'!D55","v":"Kvinder-S1"},{"$f":"'Kvinder 2x4'!E55","v":"1'er Pulje 1"},{"$f":"'Kvinder 2x4'!F55","v":"-"},{"$f":"'Kvinder 2x4'!G55","v":"2'er Pulje 2"},14]
["19:45:00","15-NH",{"$f":"'Oldboys 1x4'!A26","v":"Oldboys"},{"$f":"'Oldboys 1x4'!B26","v":"Oldboys-1"},{"$f":"'Oldboys 1x4'!C26","v":"Hvalsø 2"},{"$f":"'Oldboys 1x4'!D26","v":"-"},{"$f":"'Oldboys 1x4'!E26","v":"Kr. Hyllinge"},15]
[null,"16-NH",{"$f":"'Kvinder 2x4'!C56","v":"Kvinder"},{"$f":"'Kvinder 2x4'!D56","v":"Kvinder-S2"},{"$f":"'Kvinder 2x4'!E56","v":"1'er Pulje 2"},{"$f":"'Kvinder 2x4'!F56","v":"-"},{"$f":"'Kvinder 2x4'!G56","v":"2'er Pulje 1"},16]
["20:00:00","17-NH",{"$f":"'Oldboys 1x4'!A27","v":"Oldboys"},{"$f":"'Oldboys 1x4'!B27","v":"Oldboys-1"},{"$f":"'Oldboys 1x4'!C27","v":"Såby"},{"$f":"'Oldboys 1x4'!D27","v":"-"},{"$f":"'Oldboys 1x4'!E27","v":"Hvalsø 2"},17]
[null,null,{"$f":"'Kvinder 2x4'!C57","v":"Kvinder"},{"$f":"'Kvinder 2x4'!D57","v":"Kvinder-Fin"},{"$f":"'Kvinder 2x4'!E57","v":"Vinder Semi 1"},{"$f":"'Kvinder 2x4'!F57","v":"-"},{"$f":"'Kvinder 2x4'!G57","v":"Vinder Semi 2"},18]
["20:15:00","19-NH",{"$f":"'Oldboys 1x4'!A28","v":"Oldboys"},{"$f":"'Oldboys 1x4'!B28","v":"Oldboys-1"},{"$f":"'Oldboys 1x4'!C28","v":"Hvalsø 1"},{"$f":"'Oldboys 1x4'!D28","v":"-"},{"$f":"'Oldboys 1x4'!E28","v":"Kr. Hyllinge"},19]
[{"$nulls":4},"Kvinder Præmieoverrækkelse"]
["20:30:00","20-NH",{"$f":"'Oldboys 1x4'!A29","v":"Oldboys"},{"$f":"'Oldboys 1x4'!B29","v":"Oldboys-1"},{"$f":"'Oldboys 1x4'!C29","v":"Kr. Hyllinge"},{"$f":"'Oldboys 1x4'!D29","v":"-"},{"$f":"'Oldboys 1x4'!E29","v":"Såby"},20]
[null,"21-NH",{"$f":"'Oldboys 1x4'!A30","v":"Oldboys"},{"$f":"'Oldboys 1x4'!B30","v":"Oldboys-1"},{"$f":"'Oldboys 1x4'!C30","v":"Hvalsø 1"},{"$f":"'Oldboys 1x4'!D30","v":"-"},{"$f":"'Oldboys 1x4'!E30","v":"Hvalsø 2"},21]
["20:45:00","22-NH",{"$f":"'Herrer 4x4'!A100","v":"Herre"},{"$f":"'Herrer 4x4'!B100","v":"Herre-P1"},{"$f":"'Herrer 4x4'!C100","v":"Hvalsø 1"},{"$f":"'Herrer 4x4'!D100","v":"-"},{"$f":"'Herrer 4x4'!E100","v":"FC Lejre 1"},22]
[null,"23-NH",{"$f":"'Herrer 4x4'!A101","v":"Herre"},{"$f":"'Herrer 4x4'!B101","v":"Herre-P1"},{"$f":"'Herrer 4x4'!C101","v":"Nutella på geværet"},{"$f":"'Herrer 4x4'!D101","v":"-"},{"$f":"'Herrer 4x4'!E101","v":"10. Oktober 2009"},23]
["21:00:00","24-NH",{"$f":"+'Herrer 4x4'!A102","v":"Herre"},{"$f":"+'Herrer 4x4'!B102","v":"Herre-P4"},{"$f":"+'Herrer 4x4'!C102","v":"Daniels Helte"},{"$f":"+'Herrer 4x4'!D102","v":"-"},{"$f":"+'Herrer 4x4'!E102","v":93609319},24]
[null,{"$f":"CONCATENATE(H28,\"-\",$D$1)","v":"25-NH"},{"$f":"+'Herrer 4x4'!A103","v":"Herre"},{"$f":"+'Herrer 4x4'!B103","v":"Herre-P4"},{"$f":"+'Herrer 4x4'!C103","v":"MME Gruppen"},{"$f":"+'Herrer 4x4'!D103","v":"-"},{"$f":"+'Herrer 4x4'!E103","v":"Senior 4"},25]
["21:15:00","26-NH",{"$f":"'Oldboys 1x4'!A31","v":"Oldboys"},{"$f":"'Oldboys 1x4'!B31","v":"Oldboys 3/4"},{"$f":"'Oldboys 1x4'!C31","v":"3'er Pulje 1"},{"$f":"'Oldboys 1x4'!D31","v":"-"},{"$f":"'Oldboys 1x4'!E31","v":"4'er Pulje 1"},26]
[null,"27-NH",{"$f":"'Oldboys 1x4'!A32","v":"Oldboys"},{"$f":"'Oldboys 1x4'!B32","v":"Oldboys 1/2"},{"$f":"'Oldboys 1x4'!C32","v":"1'er Pulje 1"},{"$f":"'Oldboys 1x4'!D32","v":"-"},{"$f":"'Oldboys 1x4'!E32","v":"2'er Pulje 1"},27]
["21:30:00",null,null,null,"Oldboys - Præmieoverrækkelse"]
[null,"28-NH",{"$f":"'Herrer 4x4'!A104","v":"Herre"},{"$f":"'Herrer 4x4'!B104","v":"Herre-P1"},{"$f":"'Herrer 4x4'!C104","v":"Hvalsø 1"},{"$f":"'Herrer 4x4'!D104","v":"-"},{"$f":"'Herrer 4x4'!E104","v":"Nutella på geværet"},28]
["21:45:00","29-NH",{"$f":"'Herrer 4x4'!A105","v":"Herre"},{"$f":"'Herrer 4x4'!B105","v":"Herre-P1"},{"$f":"'Herrer 4x4'!C105","v":"FC Lejre 1"},{"$f":"'Herrer 4x4'!D105","v":"-"},{"$f":"'Herrer 4x4'!E105","v":"10. Oktober 2009"},29]
[null,"30-NH",{"$f":"+'Herrer 4x4'!A106","v":"Herre"},{"$f":"+'Herrer 4x4'!B106","v":"Herre-P4"},{"$f":"+'Herrer 4x4'!C106","v":"Daniels Helte"},{"$f":"+'Herrer 4x4'!D106","v":"-"},{"$f":"+'Herrer 4x4'!E106","v":"MME Gruppen"},30]
["22:00:00","31-NH",{"$f":"+'Herrer 4x4'!A107","v":"Herre"},{"$f":"+'Herrer 4x4'!B107","v":"Herre-P4"},{"$f":"+'Herrer 4x4'!C107","v":93609319},{"$f":"+'Herrer 4x4'!D107","v":"-"},{"$f":"+'Herrer 4x4'!E107","v":"Senior 4"},31]
[null,"32-NH",{"$f":"'Herrer 4x4'!A108","v":"Herre"},{"$f":"'Herrer 4x4'!B108","v":"Herre-P1"},{"$f":"'Herrer 4x4'!C108","v":"10. Oktober 2009"},{"$f":"'Herrer 4x4'!D108","v":"-"},{"$f":"'Herrer 4x4'!E108","v":"Hvalsø 1"},32]
["22:15:00","33-NH",{"$f":"'Herrer 4x4'!A109","v":"Herre"},{"$f":"'Herrer 4x4'!B109","v":"Herre-P1"},{"$f":"'Herrer 4x4'!C109","v":"FC Lejre 1"},{"$f":"'Herrer 4x4'!D109","v":"-"},{"$f":"'Herrer 4x4'!E109","v":"Nutella på geværet"},33]
[null,"34-NH",{"$f":"'Herrer 4x4'!A110","v":"Herre"},{"$f":"'Herrer 4x4'!B110","v":"Herre-P4"},{"$f":"'Herrer 4x4'!C110","v":"Senior 4"},{"$f":"'Herrer 4x4'!D110","v":"-"},{"$f":"'Herrer 4x4'!E110","v":"Daniels Helte"},34]
["22:30:00","35-NH",{"$f":"'Herrer 4x4'!A111","v":"Herre"},{"$f":"'Herrer 4x4'!B111","v":"Herre-P4"},{"$f":"'Herrer 4x4'!C111","v":93609319},{"$f":"'Herrer 4x4'!D111","v":"-"},{"$f":"'Herrer 4x4'!E111","v":"MME Gruppen"},35]
[{"$nulls":4},"Pause"]
["22:45:00","33-NH",{"$f":"'Herrer 4x4'!A112","v":"Herre"},{"$f":"'Herrer 4x4'!B112","v":"Herre-K1"},{"$f":"'Herrer 4x4'!C112","v":"1'er P1"},{"$f":"'Herrer 4x4'!D112","v":"-"},{"$f":"'Herrer 4x4'!E112","v":"2'er P4"},33]
[null,"34-NH",{"$f":"'Herrer 4x4'!A113","v":"Herre"},{"$f":"'Herrer 4x4'!B113","v":"Herre-K2"},{"$f":"'Herrer 4x4'!C113","v":"1'er P4"},{"$f":"'Herrer 4x4'!D113","v":"-"},{"$f":"'Herrer 4x4'!E113","v":"2'er P1"},34]
["23:00:00","35-NH",{"$f":"'Herrer 4x4'!A114","v":"Herre"},{"$f":"'Herrer 4x4'!B114","v":"Herre-K3"},{"$f":"'Herrer 4x4'!C114","v":"1'er P2"},{"$f":"'Herrer 4x4'!D114","v":"-"},{"$f":"'Herrer 4x4'!E114","v":"2'er P3"},35]
[null,"36-NH",{"$f":"'Herrer 4x4'!A115","v":"Herre"},{"$f":"'Herrer 4x4'!B115","v":"Herre-K4"},{"$f":"'Herrer 4x4'!C115","v":"1'er P3"},{"$f":"'Herrer 4x4'!D115","v":"-"},{"$f":"'Herrer 4x4'!E115","v":"2'er P2"},36]
["23:15:00",null,null,null,"Pause"]
[null,"37-NH",{"$f":"'Herrer 4x4'!A116","v":"Herre"},{"$f":"'Herrer 4x4'!B116","v":"Herre-S1"},{"$f":"'Herrer 4x4'!C116","v":"Kvart 1 Vinder"},{"$f":"'Herrer 4x4'!D116","v":"-"},{"$f":"'Herrer 4x4'!E116","v":"Kvart 3 Vinder"},37]
["23:30:00","38-NH",{"$f":"'Herrer 4x4'!A117","v":"Herre"},{"$f":"'Herrer 4x4'!B117","v":"Herre-S2"},{"$f":"'Herrer 4x4'!C117","v":"Kvart 2 Vinder"},{"$f":"'Herrer 4x4'!D117","v":"-"},{"$f":"'Herrer 4x4'!E117","v":"Kvart 4 Vinder"},38]
[{"$nulls":4},"Pause"]
["23:45:00",{"$f":"CONCATENATE(H49,\"-\",$D$1)","v":"39-NH"},{"$f":"'Herrer 4x4'!A118","v":"Herre"},{"$f":"'Herrer 4x4'!B118","v":"Finale"},{"$f":"'Herrer 4x4'!C118","v":"Semi 1 Vinder"},{"$f":"'Herrer 4x4'!D118","v":"-"},{"$f":"'Herrer 4x4'!E118","v":"Semi 2 Vinder"},39]
[{"$nulls":4},"Herre - Præmieoverrækkelse"]
[]
["Fredag 05.01.2018 GAMMEL HAL",null,null,"GH"]
["Kl.","Kamp","Årgang","Pulje","Hold",null,null,"Løbenummer"]
["18:00:00",{"$f":"CONCATENATE(H54,\"-\",$D$52)","v":"50-GH"},{"$f":"'Oldgirls 1x5'!A32","v":"Oldgirls"},{"$f":"'Oldgirls 1x5'!B32","v":"Oldgirls-1"},{"$f":"'Oldgirls 1x5'!C32","v":"Gevninge Oldgirls"},{"$f":"'Oldgirls 1x5'!D32","v":"-"},{"$f":"'Oldgirls 1x5'!E32","v":"AC - Hvalsøs smukkeste hold"},50]
[null,"51-GH",{"$f":"'Veteraner 1x5'!A32","v":"Veteraner"},{"$f":"'Veteraner 1x5'!B32","v":"Veteraner-1"},{"$f":"'Veteraner 1x5'!C32","v":"Kr. Hyllinge"},{"$f":"'Veteraner 1x5'!D32","v":"-"},{"$f":"'Veteraner 1x5'!E32","v":"HIF/8"},51]
["18:15:00","52-GH",{"$f":"'Oldgirls 1x5'!A34","v":"Oldgirls"},{"$f":"'Oldgirls 1x5'!B34","v":"Oldgirls-1"},{"$f":"'Oldgirls 1x5'!C34","v":"FC - Hvalsøs smukkeste hold"},{"$f":"'Oldgirls 1x5'!D34","v":"-"},{"$f":"'Oldgirls 1x5'!E34","v":"AC - Hvalsøs smukkeste hold"},52]
[null,"53-GH",{"$f":"'Veteraner 1x5'!A33","v":"Veteraner"},{"$f":"'Veteraner 1x5'!B33","v":"Veteraner-1"},{"$f":"'Veteraner 1x5'!C33","v":"Hvalsø 1"},{"$f":"'Veteraner 1x5'!D33","v":"-"},{"$f":"'Veteraner 1x5'!E33","v":"Hvalsø 2"},53]
["18:30:00","54-GH",{"$f":"'Oldgirls 1x5'!A33","v":"Oldgirls"},{"$f":"'Oldgirls 1x5'!B33","v":"Oldgirls-1"},{"$f":"'Oldgirls 1x5'!C33","v":"FORZA - Hvalsøs smukkeste hold"},{"$f":"'Oldgirls 1x5'!D33","v":"-"},{"$f":"'Oldgirls 1x5'!E33","v":"IF - Hvalsøs smukkeste hold"},54]
[null,"55-GH",{"$f":"'Veteraner 1x5'!A34","v":"Veteraner"},{"$f":"'Veteraner 1x5'!B34","v":"Veteraner-1"},{"$f":"'Veteraner 1x5'!C34","v":"Hvalsø 3"},{"$f":"'Veteraner 1x5'!D34","v":"-"},{"$f":"'Veteraner 1x5'!E34","v":"HIF/8"},55]
["18:45:00","56-GH",{"$f":"'Oldgirls 1x5'!A35","v":"Oldgirls"},{"$f":"'Oldgirls 1x5'!B35","v":"Oldgirls-1"},{"$f":"'Oldgirls 1x5'!C35","v":"IF - Hvalsøs smukkeste hold"},{"$f":"'Oldgirls 1x5'!D35","v":"-"},{"$f":"'Oldgirls 1x5'!E35","v":"Gevninge Oldgirls"},56]
[null,"57-GH",{"$f":"'Veteraner 1x5'!A35","v":"Veteraner"},{"$f":"'Veteraner 1x5'!B35","v":"Veteraner-1"},{"$f":"'Veteraner 1x5'!C35","v":"Hvalsø 2"},{"$f":"'Veteraner 1x5'!D35","v":"-"},{"$f":"'Veteraner 1x5'!E35","v":"Kr. Hyllinge"},57]
["19:00:00","58-GH",{"$f":"'Oldgirls 1x5'!A36","v":"Oldgirls"},{"$f":"'Oldgirls 1x5'!B36","v":"Oldgirls-1"},{"$f":"'Oldgirls 1x5'!C36","v":"FORZA - Hvalsøs smukkeste hold"},{"$f":"'Oldgirls 1x5'!D36","v":"-"},{"$f":"'Oldgirls 1x5'!E36","v":"FC - Hvalsøs smukkeste hold"},58]
[null,"59-GH",{"$f":"'Veteraner 1x5'!A36","v":"Veteraner"},{"$f":"'Veteraner 1x5'!B36","v":"Veteraner-1"},{"$f":"'Veteraner 1x5'!C36","v":"Hvalsø 1"},{"$f":"'Veteraner 1x5'!D36","v":"-"},{"$f":"'Veteraner 1x5'!E36","v":"Hvalsø 3"},59]
["19:15:00","60-GH",{"$f":"'Oldgirls 1x5'!A37","v":"Oldgirls"},{"$f":"'Oldgirls 1x5'!B37","v":"Oldgirls-1"},{"$f":"'Oldgirls 1x5'!C37","v":"IF - Hvalsøs smukkeste hold"},{"$f":"'Oldgirls 1x5'!D37","v":"-"},{"$f":"'Oldgirls 1x5'!E37","v":"AC - Hvalsøs smukkeste hold"},60]
[null,"61-GH",{"$f":"'Veteraner 1x5'!A37","v":"Veteraner"},{"$f":"'Veteraner 1x5'!B37","v":"Veteraner-1"},{"$f":"'Veteraner 1x5'!C37","v":"Hvalsø 2"},{"$f":"'Veteraner 1x5'!D37","v":"-"},{"$f":"'Veteraner 1x5'!E37","v":"HIF/8"},61]
["19:30:00","62-GH",{"$f":"'Oldgirls 1x5'!A38","v":"Oldgirls"},{"$f":"'Oldgirls 1x5'!B38","v":"Oldgirls-1"},{"$f":"'Oldgirls 1x5'!C38","v":"FC - Hvalsøs smukkeste hold"},{"$f":"'Oldgirls 1x5'!D38","v":"-"},{"$f":"'Oldgirls 1x5'!E38","v":"Gevninge Oldgirls"},62]
[null,"63-GH",{"$f":"'Veteraner 1x5'!A38","v":"Veteraner"},{"$f":"'Veteraner 1x5'!B38","v":"Veteraner-1"},{"$f":"'Veteraner 1x5'!C38","v":"Hvalsø 3"},{"$f":"'Veteraner 1x5'!D38","v":"-"},{"$f":"'Veteraner 1x5'!E38","v":"Kr. Hyllinge"},63]
["19:45:00","64-GH",{"$f":"'Oldgirls 1x5'!A39","v":"Oldgirls"},{"$f":"'Oldgirls 1x5'!B39","v":"Oldgirls-1"},{"$f":"'Oldgirls 1x5'!C39","v":"AC - Hvalsøs smukkeste hold"},{"$f":"'Oldgirls 1x5'!D39","v":"-"},{"$f":"'Oldgirls 1x5'!E39","v":"FORZA - Hvalsøs smukkeste hold"},64]
[null,"65-GH",{"$f":"'Veteraner 1x5'!A39","v":"Veteraner"},{"$f":"'Veteraner 1x5'!B39","v":"Veteraner-1"},{"$f":"'Veteraner 1x5'!C39","v":"HIF/8"},{"$f":"'Veteraner 1x5'!D39","v":"-"},{"$f":"'Veteraner 1x5'!E39","v":"Hvalsø 1"},65]
["20:00:00","66-GH",{"$f":"'Oldgirls 1x5'!A40","v":"Oldgirls"},{"$f":"'Oldgirls 1x5'!B40","v":"Oldgirls-1"},{"$f":"'Oldgirls 1x5'!C40","v":"IF - Hvalsøs smukkeste hold"},{"$f":"'Oldgirls 1x5'!D40","v":"-"},{"$f":"'Oldgirls 1x5'!E40","v":"FC - Hvalsøs smukkeste hold"},66]
[null,"67-GH",{"$f":"'Veteraner 1x5'!A40","v":"Veteraner"},{"$f":"'Veteraner 1x5'!B40","v":"Veteraner-1"},{"$f":"'Veteraner 1x5'!C40","v":"Hvalsø 2"},{"$f":"'Veteraner 1x5'!D40","v":"-"},{"$f":"'Veteraner 1x5'!E40","v":"Hvalsø 3"},67]
["20:15:00","68-GH",{"$f":"'Oldgirls 1x5'!A41","v":"Oldgirls"},{"$f":"'Oldgirls 1x5'!B41","v":"Oldgirls-1"},{"$f":"'Oldgirls 1x5'!C41","v":"Gevninge Oldgirls"},{"$f":"'Oldgirls 1x5'!D41","v":"-"},{"$f":"'Oldgirls 1x5'!E41","v":"FORZA - Hvalsøs smukkeste hold"},68]
[null,"69-GH",{"$f":"'Veteraner 1x5'!A41","v":"Veteraner"},{"$f":"'Veteraner 1x5'!B41","v":"Veteraner-1"},{"$f":"'Veteraner 1x5'!C41","v":"Kr. Hyllinge"},{"$f":"'Veteraner 1x5'!D41","v":"-"},{"$f":"'Veteraner 1x5'!E41","v":"Hvalsø 1"},69]
["20:30:00","70-GH",{"$f":"'Oldgirls 1x5'!A42","v":"Oldgirls"},{"$f":"'Oldgirls 1x5'!B42","v":"Oldgirls 3/4"},{"$f":"'Oldgirls 1x5'!C42","v":"3'er Pulje 1"},{"$f":"'Oldgirls 1x5'!D42","v":"-"},{"$f":"'Oldgirls 1x5'!E42","v":"4'er Pulje 1"},70]
[null,"71-GH",{"$f":"'Oldgirls 1x5'!A43","v":"Oldgirls"},{"$f":"'Oldgirls 1x5'!B43","v":"Oldgirls 1/2"},{"$f":"'Oldgirls 1x5'!C43","v":"1'er Pulje 1"},{"$f":"'Oldgirls 1x5'!D43","v":"-"},{"$f":"'Oldgirls 1x5'!E43","v":"2'er Pulje 1"},71]
["20:45:00",null,null,null,"Oldgirls - Præmieoverrækkelse"]
[null,"72-GH",{"$f":"'Veteraner 1x5'!A42","v":"Veteraner"},{"$f":"'Veteraner 1x5'!B42","v":"Veteraner 3/4"},{"$f":"'Veteraner 1x5'!C42","v":"3'er Pulje 1"},{"$f":"'Veteraner 1x5'!D42","v":"-"},{"$f":"'Veteraner 1x5'!E42","v":"4'er Pulje 1"},72]
["21:00:00","73-GH",{"$f":"'Veteraner 1x5'!A43","v":"Veteraner"},{"$f":"'Veteraner 1x5'!B43","v":"Veteraner 1/2"},{"$f":"'Veteraner 1x5'!C43","v":"1'er Pulje 1"},{"$f":"'Veteraner 1x5'!D43","v":"-"},{"$f":"'Veteraner 1x5'!E43","v":"2'er Pulje 1"},73]
[{"$nulls":4},"Veteraner - Præmieoverrækkelse"]
["21:15:00","74-GH",{"$f":"'Herrer 4x4'!A121","v":"Herre"},{"$f":"'Herrer 4x4'!B121","v":"Herre-P2"},{"$f":"'Herrer 4x4'!C121","v":"Hvalsø 2"},{"$f":"'Herrer 4x4'!D121","v":"-"},{"$f":"'Herrer 4x4'!E121","v":"FC Lejre 2"},74]
[null,"75-GH",{"$f":"'Herrer 4x4'!A122","v":"Herre"},{"$f":"'Herrer 4x4'!B122","v":"Herre-P3"},{"$f":"'Herrer 4x4'!C122","v":"Hvalsø 3"},{"$f":"'Herrer 4x4'!D122","v":"-"},{"$f":"'Herrer 4x4'!E122","v":"Hvalsøs yngste"},75]
["21:30:00","74-GH",{"$f":"'Herrer 4x4'!A123","v":"Herre"},{"$f":"'Herrer 4x4'!B123","v":"Herre-P2"},{"$f":"'Herrer 4x4'!C123","v":"Daddys Group"},{"$f":"'Herrer 4x4'!D123","v":"-"},{"$f":"'Herrer 4x4'!E123","v":"Såby Fodbold"},76]
[null,"77-GH",{"$f":"'Herrer 4x4'!A124","v":"Herre"},{"$f":"'Herrer 4x4'!B124","v":"Herre-P3"},{"$f":"'Herrer 4x4'!C124","v":"Klogehjørnets Diciple"},{"$f":"'Herrer 4x4'!D124","v":"-"},{"$f":"'Herrer 4x4'!E124","v":"Kr. Hyllinge"},77]
["21:45:00","78-GH",{"$f":"'Herrer 4x4'!A125","v":"Herre"},{"$f":"'Herrer 4x4'!B125","v":"Herre-P2"},{"$f":"'Herrer 4x4'!C125","v":"Hvalsø 2"},{"$f":"'Herrer 4x4'!D125","v":"-"},{"$f":"'Herrer 4x4'!E125","v":"Daddys Group"},78]
[null,"79-GH",{"$f":"'Herrer 4x4'!A126","v":"Herre"},{"$f":"'Herrer 4x4'!B126","v":"Herre-P3"},{"$f":"'Herrer 4x4'!C126","v":"Hvalsø 3"},{"$f":"'Herrer 4x4'!D126","v":"-"},{"$f":"'Herrer 4x4'!E126","v":"Klogehjørnets Diciple"},79]
["22:00:00","80-GH",{"$f":"'Herrer 4x4'!A127","v":"Herre"},{"$f":"'Herrer 4x4'!B127","v":"Herre-P2"},{"$f":"'Herrer 4x4'!C127","v":"FC Lejre 2"},{"$f":"'Herrer 4x4'!D127","v":"-"},{"$f":"'Herrer 4x4'!E127","v":"Såby Fodbold"},80]
[null,"81-GH",{"$f":"'Herrer 4x4'!A128","v":"Herre"},{"$f":"'Herrer 4x4'!B128","v":"Herre-P3"},{"$f":"'Herrer 4x4'!C128","v":"Hvalsøs yngste"},{"$f":"'Herrer 4x4'!D128","v":"-"},{"$f":"'Herrer 4x4'!E128","v":"Kr. Hyllinge"},81]
["22:15:00","82-GH",{"$f":"'Herrer 4x4'!A129","v":"Herre"},{"$f":"'Herrer 4x4'!B129","v":"Herre-P2"},{"$f":"'Herrer 4x4'!C129","v":"Såby Fodbold"},{"$f":"'Herrer 4x4'!D129","v":"-"},{"$f":"'Herrer 4x4'!E129","v":"Hvalsø 2"},82]
[null,"83-GH",{"$f":"'Herrer 4x4'!A130","v":"Herre"},{"$f":"'Herrer 4x4'!B130","v":"Herre-P3"},{"$f":"'Herrer 4x4'!C130","v":"Kr. Hyllinge"},{"$f":"'Herrer 4x4'!D130","v":"-"},{"$f":"'Herrer 4x4'!E130","v":"Hvalsø 3"},83]
["22:30:00","84-GH",{"$f":"'Herrer 4x4'!A131","v":"Herre"},{"$f":"'Herrer 4x4'!B131","v":"Herre-P2"},{"$f":"'Herrer 4x4'!C131","v":"FC Lejre 2"},{"$f":"'Herrer 4x4'!D131","v":"-"},{"$f":"'Herrer 4x4'!E131","v":"Daddys Group"},84]
[null,"85-GH",{"$f":"'Herrer 4x4'!A132","v":"Herre"},{"$f":"'Herrer 4x4'!B132","v":"Herre-P3"},{"$f":"'Herrer 4x4'!C132","v":"Hvalsøs yngste"},{"$f":"'Herrer 4x4'!D132","v":"-"},{"$f":"'Herrer 4x4'!E132","v":"Klogehjørnets Diciple"},85]

{"sheet":"Kvinder 2x4","index":1,"n_rows":57,"n_cols":20,"rows_kept":57,"cut":false,"hidden":false,"merged":[[10,2,10,4],[11,6,11,8],[11,12,11,14],[29,2,29,4],[30,6,30,8],[30,12,30,14]]}
[null,null,"Kvinder",null,"8 Hold"]
[]
[null,null,"Resultat pulje 1",null,"Kvinder-1",1]
[null,null,"Indtast holdnavn"]
[null,null,"Hold 1 ","=","Hvalsø 1",null,"Der må kun indtastes i de sandfarvede felter"]
[null,null,"Hold 2","=","Hvalsø 2"]
[null,null,"Hold 3","=","TBK"]
[null,null,"Hold 4","=","Kr. Hyllinge"]
[null,null,"Hold 5","=","Hold 5"]
[]
[null,null,"PULJE MED 4 HOLD"]
[{"$nulls":6},"Resultat",{"$nulls":4},"Kampe","Målscore",null,null,"Point"]
[null,null,{"$f":"+$E$5","v":"Hvalsø 1"},"-",{"$f":"+$E$6","v":"Hvalsø 2"},null,null,"-",null,null,{"$f":"E5","v":"Hvalsø 1"},{"$f":"IF($G$13<>\"\",1,0)+IF($G$15<>\"\",1,0)+IF($I$17<>\"\",1,0)","v":0},{"$f":"$G$13+$G$15+$I$17","v":0},"-",{"$f":"$I$13+$I$15+$G$17","v":0},{"$f":"IF($G$13<>\"\",$R$13,0)+IF($G$15<>\"\",$S$13,0)+IF($I$17<>\"\",$T$13,0)","v":0},null,{"$f":"IF($G$13>$I$13,3,IF($G$13=$I$13,1,0))","v":1},{"$f":"IF($G$15>$I$15,3,IF($G$15=$I$15,1,0))","v":1},{"$f":"IF($I$17>$G$17,3,IF($I$17=$G$17,1,0))","v":1}]
[null,null,{"$f":"+$E$7","v":"TBK"},"-",{"$f":"+$E$8","v":"Kr. Hyllinge"},null,null,"-",null,null,{"$f":"E6","v":"Hvalsø 2"},{"$f":"IF($I$13<>\"\",1,0)+IF($G$16<>\"\",1,0)+IF($G$18<>\"\",1,0)","v":0},{"$f":"$I$13+$G$16+$G$18","v":0},"-",{"$f":"$G$13+$I$16+$I$18","v":0},{"$f":"IF($I$13<>\"\",$R$14,0)+IF($G$16<>\"\",$S$14,0)+IF($G$18<>\"\",$T$14,0)","v":0},null,{"$f":"IF($I$13>$G$13,3,IF($G$13=$I$13,1,0))","v":1},{"$f":"IF($G$16>$I$16,3,IF($G$16=$I$16,1,0))","v":1},{"$f":"IF($G$18>$I$18,3,IF($I$18=$G$18,1,0))","v":1}]
[null,null,{"$f":"+$E$5","v":"Hvalsø 1"},"-",{"$f":"+$E$7","v":"TBK"},null,null,"-",null,null,{"$f":"E7","v":"TBK"},{"$f":"IF($G$14<>\"\",1,0)+IF($I$15<>\"\",1,0)+IF($I$18<>\"\",1,0)","v":0},{"$f":"$G$14+$I$15+$I$18","v":0},"-",{"$f":"$I$14+$G$15+$G$18","v":0},{"$f":"IF($G$14<>\"\",$R$15,0)+IF($I$15<>\"\",$S$15,0)+IF($I$18<>\"\",$T$15,0)","v":0},null,{"$f":"IF($G$14>$I$14,3,IF($G$14=$I$14,1,0))","v":1},{"$f":"IF($I$15>$G$15,3,IF($G$15=$I$15,1,0))","v":1},{"$f":"IF($I$18>$G$18,3,IF($I$18=$G$18,1,0))","v":1}]
[null,null,{"$f":"+$E$6","v":"Hvalsø 2"},"-",{"$f":"+$E$8","v":"Kr. Hyllinge"},null,null,"-",null,null,{"$f":"E8","v":"Kr. Hyllinge"},{"$f":"IF($I$14<>\"\",1,0)+IF($I$16<>\"\",1,0)+IF($G$17<>\"\",1,0)","v":0},{"$f":"$I$14+$I$16+$G$17","v":0},"-",{"$f":"$G$14+$G$16+$I$17","v":0},{"$f":"IF($I$14<>\"\",$R$16,0)+IF($I$16<>\"\",$S$16,0)+IF($G$17<>\"\",$T$16,0)","v":0},null,{"$f":"IF($I$14>$G$14,3,IF($G$14=$I$14,1,0))","v":1},{"$f":"IF($I$16>$G$16,3,IF($G$16=$I$16,1,0))","v":1},{"$f":"IF($G$17>$I$17,3,IF($I$17=$G$17,1,0))","v":1}]
[null,null,{"$f":"+$E$8","v":"Kr. Hyllinge"},"-",{"$f":"+$E$5","v":"Hvalsø 1"},null,null,"-"]
[null,null,{"$f":"+$E$6","v":"Hvalsø 2"},"-",{"$f":"+$E$7","v":"TBK"},null,null,"-"]
[]
[null,null,"Der må kun indtastes i de sandfarvede felter"]
[]
[null,null,"Resultat pulje 2",null,"Kvinder-2",1]
[null,null,"Indtast holdnavn"]
[null,null,"Hold 1 ","=","Hvalsø 3",null,"Der må kun indtastes i de sandfarvede felter"]
[null,null,"Hold 2","=","Hvalsø 4"]
[null,null,"Hold 3","=","Team Susanne"]
[null,null,"Hold 4","=","FC Lejre"]
[null,null,"Hold 5","=","Hold 5"]
[]
[null,null,"PULJE MED 4 HOLD"]
[{"$nulls":6},"Resultat",{"$nulls":4},"Kampe","Målscore",null,null,"Point"]
[null,null,{"$f":"+$E$24","v":"Hvalsø 3"},"-",{"$f":"+$E$25","v":"Hvalsø 4"},null,null,"-",null,null,{"$f":"E24","v":"Hvalsø 3"},{"$f":"IF($G$32<>\"\",1,0)+IF($G$34<>\"\",1,0)+IF($I$36<>\"\",1,0)","v":0},{"$f":"$G$32+$G$34+$I$36","v":0},"-",{"$f":"$I$32+$I$34+$G$36","v":0},{"$f":"IF($G$32<>\"\",$R$32,0)+IF($G$34<>\"\",$S$32,0)+IF($I$36<>\"\",$T$32,0)","v":0},null,{"$f":"IF($G$32>$I$32,3,IF($G$32=$I$32,1,0))","v":1},{"$f":"IF($G$34>$I$34,3,IF($G$34=$I$34,1,0))","v":1},{"$f":"IF($I$36>$G$36,3,IF($I$36=$G$36,1,0))","v":1}]
[null,null,{"$f":"+$E$26","v":"Team Susanne"},"-",{"$f":"+$E$27","v":"FC Lejre"},null,null,"-",null,null,{"$f":"E25","v":"Hvalsø 4"},{"$f":"IF($I$32<>\"\",1,0)+IF($G$35<>\"\",1,0)+IF($G$37<>\"\",1,0)","v":0},{"$f":"$I$32+$G$35+$G$37","v":0},"-",{"$f":"$G$32+$I$35+$I$37","v":0},{"$f":"IF($I$32<>\"\",$R$33,0)+IF($G$35<>\"\",$S$33,0)+IF($G$37<>\"\",$T$33,0)","v":0},null,{"$f":"IF($I$32>$G$32,3,IF($G$32=$I$32,1,0))","v":1},{"$f":"IF($G$35>$I$35,3,IF($G$35=$I$35,1,0))","v":1},{"$f":"IF($G$37>$I$37,3,IF($I$37=$G$37,1,0))","v":1}]
[null,null,{"$f":"+$E$24","v":"Hvalsø 3"},"-",{"$f":"+$E$26","v":"Team Susanne"},null,null,"-",null,null,{"$f":"E26","v":"Team Susanne"},{"$f":"IF($G$33<>\"\",1,0)+IF($I$34<>\"\",1,0)+IF($I$37<>\"\",1,0)","v":0},{"$f":"$G$33+$I$34+$I$37","v":0},"-",{"$f":"$I$33+$G$34+$G$37","v":0},{"$f":"IF($G$33<>\"\",$R$34,0)+IF($I$34<>\"\",$S$34,0)+IF($I$37<>\"\",$T$34,0)","v":0},null,{"$f":"IF($G$33>$I$33,3,IF($G$33=$I$33,1,0))","v":1},{"$f":"IF($I$34>$G$34,3,IF($G$34=$I$34,1,0))","v":1},{"$f":"IF($I$37>$G$37,3,IF($I$37=$G$37,1,0))","v":1}]
[null,null,{"$f":"+$E$25","v":"Hvalsø 4"},"-",{"$f":"+$E$27","v":"FC Lejre"},null,null,"-",null,null,{"$f":"E27","v":"FC Lejre"},{"$f":"IF($I$33<>\"\",1,0)+IF($I$35<>\"\",1,0)+IF($G$36<>\"\",1,0)","v":0},{"$f":"$I$33+$I$35+$G$36","v":0},"-",{"$f":"$G$33+$G$35+$I$36","v":0},{"$f":"IF($I$33<>\"\",$R$35,0)+IF($I$35<>\"\",$S$35,0)+IF($G$36<>\"\",$T$35,0)","v":0},null,{"$f":"IF($I$33>$G$33,3,IF($G$33=$I$33,1,0))","v":1},{"$f":"IF($I$35>$G$35,3,IF($G$35=$I$35,1,0))","v":1},{"$f":"IF($G$36>$I$36,3,IF($I$36=$G$36,1,0))","v":1}]
[null,null,{"$f":"+$E$27","v":"FC Lejre"},"-",{"$f":"+$E$24","v":"Hvalsø 3"},null,null,"-"]
[null,null,{"$f":"+$E$25","v":"Hvalsø 4"},"-",{"$f":"+$E$26","v":"Team Susanne"},null,null,"-"]
[]
[null,null,"Der må kun indtastes i de sandfarvede felter"]
[]
[]
[null,null,"Årgang","Pulje","Kampprogram Hal B"]
[null,null,{"$f":"$C$1","v":"Kvinder"},{"$f":"E$3","v":"Kvinder-1"},{"$f":"C13","v":"Hvalsø 1"},{"$f":"D13","v":"-"},{"$f":"E13","v":"Hvalsø 2"}]
[null,null,{"$f":"$C$1","v":"Kvinder"},{"$f":"E$22","v":"Kvinder-2"},{"$f":"C32","v":"Hvalsø 3"},{"$f":"D32","v":"-"},{"$f":"E32","v":"Hvalsø 4"}]
[null,null,"Kvinder",{"$f":"E$3","v":"Kvinder-1"},{"$f":"C14","v":"TBK"},{"$f":"D14","v":"-"},{"$f":"E14","v":"Kr. Hyllinge"}]
[null,null,"Kvinder",{"$f":"E$22","v":"Kvinder-2"},{"$f":"C33","v":"Team Susanne"},{"$f":"D33","v":"-"},{"$f":"E33","v":"FC Lejre"}]
[null,null,"Kvinder",{"$f":"E$3","v":"Kvinder-1"},{"$f":"C15","v":"Hvalsø 1"},{"$f":"D15","v":"-"},{"$f":"E15","v":"TBK"}]
[null,null,"Kvinder",{"$f":"E$22","v":"Kvinder-2"},{"$f":"C34","v":"Hvalsø 3"},{"$f":"D34","v":"-"},{"$f":"E34","v":"Team Susanne"}]
[null,null,"Kvinder",{"$f":"E$3","v":"Kvinder-1"},{"$f":"C16","v":"Hvalsø 2"},{"$f":"D16","v":"-"},{"$f":"E16","v":"Kr. Hyllinge"}]
[null,null,"Kvinder",{"$f":"E$22","v":"Kvinder-2"},{"$f":"C35","v":"Hvalsø 4"},{"$f":"D35","v":"-"},{"$f":"E35","v":"FC Lejre"}]
[null,null,"Kvinder",{"$f":"E$3","v":"Kvinder-1"},{"$f":"C17","v":"Kr. Hyllinge"},{"$f":"D17","v":"-"},{"$f":"E17","v":"Hvalsø 1"}]
[null,null,"Kvinder",{"$f":"E$22","v":"Kvinder-2"},{"$f":"C36","v":"FC Lejre"},{"$f":"D36","v":"-"},{"$f":"E36","v":"Hvalsø 3"}]
[null,null,{"$f":"$C$1","v":"Kvinder"},{"$f":"E$3","v":"Kvinder-1"},{"$f":"C18","v":"Hvalsø 2"},{"$f":"D18","v":"-"},{"$f":"E18","v":"TBK"}]
[null,null,{"$f":"$C$1","v":"Kvinder"},{"$f":"E$22","v":"Kvinder-2"},{"$f":"C37","v":"Hvalsø 4"},{"$f":"D37","v":"-"},{"$f":"E37","v":"Team Susanne"}]
[null,null,"Kvinder","Kvinder-S1","1'er Pulje 1","-","2'er Pulje 2"]
[null,null,"Kvinder","Kvinder-S2","1'er Pulje 2","-","2'er Pulje 1"]
[null,null,"Kvinder","Kvinder-Fin","Vinder Semi 1","-","Vinder Semi 2"]

{"sheet":"Oldgirls 1x5","index":2,"n_rows":43,"n_cols":21,"rows_kept":43,"cut":false,"hidden":false,"merged":[[11,2,11,4],[12,6,12,8],[12,12,12,14]]}
[null,null,"Oldgirls",null,"5 Hold"]
[]
[null,null,"Resultat pulje",null,"Oldgirls-1",1]
[null,null,"Indtast holdnavn"]
[null,null,"Hold 1 ","=","FORZA - Hvalsøs smukkeste hold",null,"Der må kun indtastes i de sandfarvede felter"]
[null,null,"Hold 2","=","IF - Hvalsøs smukkeste hold"]
[null,null,"Hold 3","=","FC - Hvalsøs smukkeste hold"]
[null,null,"Hold 4","=","AC - Hvalsøs smukkeste hold"]
[null,null,"Hold 5","=","Gevninge Oldgirls"]
[]
[]
[null,null,"PULJE MED 5 HOLD"]
[{"$nulls":6},"Resultat",{"$nulls":4},"Kampe","Målscore",null,null,"Point"]
[null,null,{"$f":"+$E$9","v":"Gevninge Oldgirls"},"-",{"$f":"+$E$8","v":"AC - Hvalsøs smukkeste hold"},null,null,"-",null,null,"Hold 1",{"$f":"IF($G$15<>\"\",1,0)+IF($G$18<>\"\",1,0)+IF($I$23<>\"\",1,0)+IF($I$21<>\"\",1,0)","v":0},{"$f":"$G$15+$G$18+$I$21+$I$23","v":0},"-",{"$f":"$I$15+$I$18+$G$21+$G$23","v":0},{"$f":"IF($G$15<>\"\",$R$14,0)+IF($G$18<>\"\",$S$14,0)+IF($I$21<>\"\",$T$14,0)+IF($I$23<>\"\",$U$14,0)","v":0},null,{"$f":"IF($G$15>$I$15,3,IF($G$15=$I$15,1,0))","v":1},{"$f":"IF($G$18>$I$18,3,IF($G$18=$I$18,1,0))","v":1},{"$f":"IF($I$21>$G$21,3,IF($I$21=$G$21,1,0))","v":1},{"$f":"IF($I$23>$G$23,3,IF($I$23=$G$23,1,0))","v":1}]
[null,null,{"$f":"+$E$5","v":"FORZA - Hvalsøs smukkeste hold"},"-",{"$f":"+$E$6","v":"IF - Hvalsøs smukkeste hold"},null,null,"-",null,null,"Hold 2",{"$f":"IF($I$15<>\"\",1,0)+IF($G$17<>\"\",1,0)+IF($G$19<>\"\",1,0)+IF($G$22<>\"\",1,0)","v":0},{"$f":"$I$15+$G$19+$G$22+$G$17","v":0},"-",{"$f":"$G$15+$I$19+$I$22+$I$17","v":0},{"$f":"IF($I$15<>\"\",$R$15,0)+IF($G$19<>\"\",$S$15,0)+IF($G$22<>\"\",$T$15,0)+IF($G$17<>\"\",$U$15,0)","v":0},null,{"$f":"IF($I$15>$G$15,3,IF($G$15=$I$15,1,0))","v":1},{"$f":"IF($G$19>$I$19,3,IF($G$19=$I$19,1,0))","v":1},{"$f":"IF($G$22>$I$22,3,IF($I$22=$G$22,1,0))","v":1},{"$f":"IF($G$17>$I$17,3,IF($I$17=$G$17,1,0))","v":1}]
[null,null,{"$f":"+$E$7","v":"FC - Hvalsøs smukkeste hold"},"-",{"$f":"+$E$8","v":"AC - Hvalsøs smukkeste hold"},null,null,"-",null,null,"Hold 3",{"$f":"IF($G$16<>\"\",1,0)+IF($G$20<>\"\",1,0)+IF($I$18<>\"\",1,0)+IF($I$22<>\"\",1,0)","v":0},{"$f":"$G$16+$I$18+$I$22+$G$20","v":0},"-",{"$f":"$I$16+$G$18+$G$22+$I$20","v":0},{"$f":"IF($G$16<>\"\",$R$16,0)+IF($I$18<>\"\",$S$16,0)+IF($I$22<>\"\",$T$16,0)+IF($I$20<>\"\",$U$16,0)","v":0},null,{"$f":"IF($G$16>$I$16,3,IF($G$16=$I$16,1,0))","v":1},{"$f":"IF($I$18>$G$18,3,IF($G$18=$I$18,1,0))","v":1},{"$f":"IF($I$22>$G$22,3,IF($I$22=$G$22,1,0))","v":1},{"$f":"IF($G$20>$I$20,3,IF($I$20=$G$20,1,0))","v":1}]
[null,null,{"$f":"+$E$6","v":"IF - Hvalsøs smukkeste hold"},"-",{"$f":"+$E$9","v":"Gevninge Oldgirls"},null,null,"-",null,null,"Hold 4",{"$f":"IF($I$14<>\"\",1,0)+IF($I$16<>\"\",1,0)+IF($I$19<>\"\",1,0)+IF($G$21<>\"\",1,0)","v":0},{"$f":"$I$16+$I$19+$G$21+$I$14","v":0},"-",{"$f":"$G$16+$G$19+$I$21+$G$14","v":0},{"$f":"IF($I$16<>\"\",$R$17,0)+IF($I$19<>\"\",$S$17,0)+IF($G$21<>\"\",$T$17,0)+IF($G$14<>\"\",$U$17,0)","v":0},null,{"$f":"IF($I$16>$G$16,3,IF($G$16=$I$16,1,0))","v":1},{"$f":"IF($I$19>$G$19,3,IF($G$19=$I$19,1,0))","v":1},{"$f":"IF($G$21>$I$21,3,IF($I$21=$G$21,1,0))","v":1},{"$f":"IF($I$14>$G$14,3,IF($I$14=$G$14,1,0))","v":1}]
[null,null,{"$f":"+$E$5","v":"FORZA - Hvalsøs smukkeste hold"},"-",{"$f":"+$E$7","v":"FC - Hvalsøs smukkeste hold"},null,null,"-",null,null,"Hold 5",{"$f":"IF($G$14<>\"\",1,0)+IF($I$17<>\"\",1,0)+IF($I$20<>\"\",1,0)+IF($G$23<>\"\",1,0)","v":0},{"$f":"$G$14+$I$17+$I$20+$G$23","v":0},"-",{"$f":"$I$14+$G$17+$G$20+$I$23","v":0},{"$f":"IF($G$14<>\"\",$R$18,0)+IF($I$17<>\"\",$S$18,0)+IF($I$20<>\"\",$T$18,0)+IF($G$23<>\"\",$T$18,0)","v":0},null,{"$f":"IF($G$14>$I$14,3,IF($G$14=$I$14,1,0))","v":1},{"$f":"IF($I$17>$G$17,3,IF($G$17=$I$17,1,0))","v":1},{"$f":"IF($I$20>$G$20,3,IF($I$20=$G$20,1,0))","v":1},{"$f":"IF($G$23>$I$23,3,IF($I$23=$G$23,1,0))","v":1}]
[null,null,{"$f":"+$E$6","v":"IF - Hvalsøs smukkeste hold"},"-",{"$f":"+$E$8","v":"AC - Hvalsøs smukkeste hold"},null,null,"-"]
[null,null,{"$f":"+$E$7","v":"FC - Hvalsøs smukkeste hold"},"-",{"$f":"+$E$9","v":"Gevninge Oldgirls"},null,null,"-"]
[null,null,{"$f":"+$E$8","v":"AC - Hvalsøs smukkeste hold"},"-",{"$f":"+$E$5","v":"FORZA - Hvalsøs smukkeste hold"},null,null,"-"]
[null,null,{"$f":"+$E$6","v":"IF - Hvalsøs smukkeste hold"},"-",{"$f":"+$E$7","v":"FC - Hvalsøs smukkeste hold"},null,null,"-"]
[null,null,{"$f":"+$E$9","v":"Gevninge Oldgirls"},"-",{"$f":"+$E$5","v":"FORZA - Hvalsøs smukkeste hold"},null,null,"-"]
[]
[null,null,"Der må kun indtastes i de sandfarvede felter"]
[]
[]
[]
[]
[]
["Årgang","Pulje","Kampprogram Hal N"]
[{"$f":"$C$1","v":"Oldgirls"},{"$f":"E$3","v":"Oldgirls-1"},{"$f":"C14","v":"Gevninge Oldgirls"},"-","AC - Hvalsøs smukkeste hold"]
[{"$f":"$C$1","v":"Oldgirls"},{"$f":"E$3","v":"Oldgirls-1"},"FORZA - Hvalsøs smukkeste hold","-","IF - Hvalsøs smukkeste hold"]
[{"$f":"$C$1","v":"Oldgirls"},"Oldgirls-1","FC - Hvalsøs smukkeste hold","-","AC - Hvalsøs smukkeste hold"]
["Oldgirls","Oldgirls-1","IF - Hvalsøs smukkeste hold","-","Gevninge Oldgirls"]
["Oldgirls","Oldgirls-1","FORZA - Hvalsøs smukkeste hold","-","FC - Hvalsøs smukkeste hold"]
["Oldgirls","Oldgirls-1","IF - Hvalsøs smukkeste hold","-","AC - Hvalsøs smukkeste hold"]
["Oldgirls","Oldgirls-1","FC - Hvalsøs smukkeste hold","-","Gevninge Oldgirls"]
["Oldgirls","Oldgirls-1","AC - Hvalsøs smukkeste hold","-","FORZA - Hvalsøs smukkeste hold"]
["Oldgirls","Oldgirls-1","IF - Hvalsøs smukkeste hold","-","FC - Hvalsøs smukkeste hold"]
["Oldgirls","Oldgirls-1","Gevninge Oldgirls","-","FORZA - Hvalsøs smukkeste hold"]
["Oldgirls","Oldgirls 3/4","3'er Pulje 1","-","4'er Pulje 1"]
["Oldgirls","Oldgirls 1/2","1'er Pulje 1","-","2'er Pulje 1"]

{"sheet":"Oldboys 1x4","index":3,"n_rows":32,"n_cols":20,"rows_kept":32,"cut":false,"hidden":false,"merged":[[10,2,10,4],[11,6,11,8],[11,12,11,14]]}
[null,null,"Oldboys",null,"4 Hold"]
[]
[null,null,"Resultat pulje 1",null,"Oldboys-1",1]
[null,null,"Indtast holdnavn"]
[null,null,"Hold 1 ","=","Såby",null,"Der må kun indtastes i de sandfarvede felter"]
[null,null,"Hold 2","=","Hvalsø 1"]
[null,null,"Hold 3","=","Hvalsø 2"]
[null,null,"Hold 4","=","Kr. Hyllinge"]
[null,null,"Hold 5","=","Hold 5"]
[]
[null,null,"PULJE MED 4 HOLD"]
[{"$nulls":6},"Resultat",{"$nulls":4},"Kampe","Målscore",null,null,"Point"]
[null,null,{"$f":"+$E$5","v":"Såby"},"-",{"$f":"+$E$6","v":"Hvalsø 1"},null,null,"-",null,null,{"$f":"E5","v":"Såby"},{"$f":"IF($G$13<>\"\",1,0)+IF($G$15<>\"\",1,0)+IF($I$17<>\"\",1,0)","v":0},{"$f":"$G$13+$G$15+$I$17","v":0},"-",{"$f":"$I$13+$I$15+$G$17","v":0},{"$f":"IF($G$13<>\"\",$R$13,0)+IF($G$15<>\"\",$S$13,0)+IF($I$17<>\"\",$T$13,0)","v":0},null,{"$f":"IF($G$13>$I$13,3,IF($G$13=$I$13,1,0))","v":1},{"$f":"IF($G$15>$I$15,3,IF($G$15=$I$15,1,0))","v":1},{"$f":"IF($I$17>$G$17,3,IF($I$17=$G$17,1,0))","v":1}]
[null,null,{"$f":"+$E$7","v":"Hvalsø 2"},"-",{"$f":"+$E$8","v":"Kr. Hyllinge"},null,null,"-",null,null,{"$f":"E6","v":"Hvalsø 1"},{"$f":"IF($I$13<>\"\",1,0)+IF($G$16<>\"\",1,0)+IF($G$18<>\"\",1,0)","v":0},{"$f":"$I$13+$G$16+$G$18","v":0},"-",{"$f":"$G$13+$I$16+$I$18","v":0},{"$f":"IF($I$13<>\"\",$R$14,0)+IF($G$16<>\"\",$S$14,0)+IF($G$18<>\"\",$T$14,0)","v":0},null,{"$f":"IF($I$13>$G$13,3,IF($G$13=$I$13,1,0))","v":1},{"$f":"IF($G$16>$I$16,3,IF($G$16=$I$16,1,0))","v":1},{"$f":"IF($G$18>$I$18,3,IF($I$18=$G$18,1,0))","v":1}]
[null,null,{"$f":"+$E$5","v":"Såby"},"-",{"$f":"+$E$7","v":"Hvalsø 2"},null,null,"-",null,null,{"$f":"E7","v":"Hvalsø 2"},{"$f":"IF($G$14<>\"\",1,0)+IF($I$15<>\"\",1,0)+IF($I$18<>\"\",1,0)","v":0},{"$f":"$G$14+$I$15+$I$18","v":0},"-",{"$f":"$I$14+$G$15+$G$18","v":0},{"$f":"IF($G$14<>\"\",$R$15,0)+IF($I$15<>\"\",$S$15,0)+IF($I$18<>\"\",$T$15,0)","v":0},null,{"$f":"IF($G$14>$I$14,3,IF($G$14=$I$14,1,0))","v":1},{"$f":"IF($I$15>$G$15,3,IF($G$15=$I$15,1,0))","v":1},{"$f":"IF($I$18>$G$18,3,IF($I$18=$G$18,1,0))","v":1}]
[null,null,{"$f":"+$E$6","v":"Hvalsø 1"},"-",{"$f":"+$E$8","v":"Kr. Hyllinge"},null,null,"-",null,null,{"$f":"E8","v":"Kr. Hyllinge"},{"$f":"IF($I$14<>\"\",1,0)+IF($I$16<>\"\",1,0)+IF($G$17<>\"\",1,0)","v":0},{"$f":"$I$14+$I$16+$G$17","v":0},"-",{"$f":"$G$14+$G$16+$I$17","v":0},{"$f":"IF($I$14<>\"\",$R$16,0)+IF($I$16<>\"\",$S$16,0)+IF($G$17<>\"\",$T$16,0)","v":0},null,{"$f":"IF($I$14>$G$14,3,IF($G$14=$I$14,1,0))","v":1},{"$f":"IF($I$16>$G$16,3,IF($G$16=$I$16,1,0))","v":1},{"$f":"IF($G$17>$I$17,3,IF($I$17=$G$17,1,0))","v":1}]
[null,null,{"$f":"+$E$8","v":"Kr. Hyllinge"},"-",{"$f":"+$E$5","v":"Såby"},null,null,"-"]
[null,null,{"$f":"+$E$6","v":"Hvalsø 1"},"-",{"$f":"+$E$7","v":"Hvalsø 2"},null,null,"-"]
[]
[null,null,"Der må kun indtastes i de sandfarvede felter"]
[]
[]
[]
["Årgang","Pulje","Kampprogram Gammel Hal"]
[{"$f":"$C$1","v":"Oldboys"},{"$f":"E$3","v":"Oldboys-1"},{"$f":"C13","v":"Såby"},"-","Hvalsø 1"]
[{"$f":"$C$1","v":"Oldboys"},{"$f":"E$3","v":"Oldboys-1"},"Hvalsø 2","-","Kr. Hyllinge"]
["Oldboys",{"$f":"E$3","v":"Oldboys-1"},"Såby","-","Hvalsø 2"]
["Oldboys",{"$f":"E$3","v":"Oldboys-1"},"Hvalsø 1","-","Kr. Hyllinge"]
["Oldboys",{"$f":"E$3","v":"Oldboys-1"},"Kr. Hyllinge","-","Såby"]
["Oldboys",{"$f":"E$3","v":"Oldboys-1"},"Hvalsø 1","-","Hvalsø 2"]
["Oldboys","Oldboys 3/4","3'er Pulje 1","-","4'er Pulje 1"]
["Oldboys","Oldboys 1/2","1'er Pulje 1","-","2'er Pulje 1"]

{"sheet":"Veteraner 1x5","index":4,"n_rows":43,"n_cols":21,"rows_kept":43,"cut":false,"hidden":false,"merged":[[11,2,11,4],[12,6,12,8],[12,12,12,14]]}
[null,null,"Veteraner",null,"5 Hold"]
[]
[null,null,"Resultat pulje",null,"Veteraner-1",1]
[null,null,"Indtast holdnavn"]
[null,null,"Hold 1 ","=","Hvalsø 1",null,"Der må kun indtastes i de sandfarvede felter"]
[null,null,"Hold 2","=","Hvalsø 2"]
[null,null,"Hold 3","=","Hvalsø 3"]
[null,null,"Hold 4","=","HIF/8"]
[null,null,"Hold 5","=","Kr. Hyllinge"]
[]
[]
[null,null,"PULJE MED 5 HOLD"]
[{"$nulls":6},"Resultat",{"$nulls":4},"Kampe","Målscore",null,null,"Point"]
[null,null,{"$f":"+$E$9","v":"Kr. Hyllinge"},"-",{"$f":"+$E$8","v":"HIF/8"},null,null,"-",null,null,"Hold 1",{"$f":"IF($G$15<>\"\",1,0)+IF($G$18<>\"\",1,0)+IF($I$23<>\"\",1,0)+IF($I$21<>\"\",1,0)","v":0},{"$f":"$G$15+$G$18+$I$21+$I$23","v":0},"-",{"$f":"$I$15+$I$18+$G$21+$G$23","v":0},{"$f":"IF($G$15<>\"\",$R$14,0)+IF($G$18<>\"\",$S$14,0)+IF($I$21<>\"\",$T$14,0)+IF($I$23<>\"\",$U$14,0)","v":0},null,{"$f":"IF($G$15>$I$15,3,IF($G$15=$I$15,1,0))","v":1},{"$f":"IF($G$18>$I$18,3,IF($G$18=$I$18,1,0))","v":1},{"$f":"IF($I$21>$G$21,3,IF($I$21=$G$21,1,0))","v":1},{"$f":"IF($I$23>$G$23,3,IF($I$23=$G$23,1,0))","v":1}]
[null,null,{"$f":"+$E$5","v":"Hvalsø 1"},"-",{"$f":"+$E$6","v":"Hvalsø 2"},null,null,"-",null,null,"Hold 2",{"$f":"IF($I$15<>\"\",1,0)+IF($G$17<>\"\",1,0)+IF($G$19<>\"\",1,0)+IF($G$22<>\"\",1,0)","v":0},{"$f":"$I$15+$G$19+$G$22+$G$17","v":0},"-",{"$f":"$G$15+$I$19+$I$22+$I$17","v":0},{"$f":"IF($I$15<>\"\",$R$15,0)+IF($G$19<>\"\",$S$15,0)+IF($G$22<>\"\",$T$15,0)+IF($G$17<>\"\",$U$15,0)","v":0},null,{"$f":"IF($I$15>$G$15,3,IF($G$15=$I$15,1,0))","v":1},{"$f":"IF($G$19>$I$19,3,IF($G$19=$I$19,1,0))","v":1},{"$f":"IF($G$22>$I$22,3,IF($I$22=$G$22,1,0))","v":1},{"$f":"IF($G$17>$I$17,3,IF($I$17=$G$17,1,0))","v":1}]
[null,null,{"$f":"+$E$7","v":"Hvalsø 3"},"-",{"$f":"+$E$8","v":"HIF/8"},null,null,"-",null,null,"Hold 3",{"$f":"IF($G$16<>\"\",1,0)+IF($G$20<>\"\",1,0)+IF($I$18<>\"\",1,0)+IF($I$22<>\"\",1,0)","v":0},{"$f":"$G$16+$I$18+$I$22+$G$20","v":0},"-",{"$f":"$I$16+$G$18+$G$22+$I$20","v":0},{"$f":"IF($G$16<>\"\",$R$16,0)+IF($I$18<>\"\",$S$16,0)+IF($I$22<>\"\",$T$16,0)+IF($I$20<>\"\",$U$16,0)","v":0},null,{"$f":"IF($G$16>$I$16,3,IF($G$16=$I$16,1,0))","v":1},{"$f":"IF($I$18>$G$18,3,IF($G$18=$I$18,1,0))","v":1},{"$f":"IF($I$22>$G$22,3,IF($I$22=$G$22,1,0))","v":1},{"$f":"IF($G$20>$I$20,3,IF($I$20=$G$20,1,0))","v":1}]
[null,null,{"$f":"+$E$6","v":"Hvalsø 2"},"-",{"$f":"+$E$9","v":"Kr. Hyllinge"},null,null,"-",null,null,"Hold 4",{"$f":"IF($I$14<>\"\",1,0)+IF($I$16<>\"\",1,0)+IF($I$19<>\"\",1,0)+IF($G$21<>\"\",1,0)","v":0},{"$f":"$I$16+$I$19+$G$21+$I$14","v":0},"-",{"$f":"$G$16+$G$19+$I$21+$G$14","v":0},{"$f":"IF($I$16<>\"\",$R$17,0)+IF($I$19<>\"\",$S$17,0)+IF($G$21<>\"\",$T$17,0)+IF($G$14<>\"\",$U$17,0)","v":0},null,{"$f":"IF($I$16>$G$16,3,IF($G$16=$I$16,1,0))","v":1},{"$f":"IF($I$19>$G$19,3,IF($G$19=$I$19,1,0))","v":1},{"$f":"IF($G$21>$I$21,3,IF($I$21=$G$21,1,0))","v":1},{"$f":"IF($I$14>$G$14,3,IF($I$14=$G$14,1,0))","v":1}]
[null,null,{"$f":"+$E$5","v":"Hvalsø 1"},"-",{"$f":"+$E$7","v":"Hvalsø 3"},null,null,"-",null,null,"Hold 5",{"$f":"IF($G$14<>\"\",1,0)+IF($I$17<>\"\",1,0)+IF($I$20<>\"\",1,0)+IF($G$23<>\"\",1,0)","v":0},{"$f":"$G$14+$I$17+$I$20+$G$23","v":0},"-",{"$f":"$I$14+$G$17+$G$20+$I$23","v":0},{"$f":"IF($G$14<>\"\",$R$18,0)+IF($I$17<>\"\",$S$18,0)+IF($I$20<>\"\",$T$18,0)+IF($G$23<>\"\",$T$18,0)","v":0},null,{"$f":"IF($G$14>$I$14,3,IF($G$14=$I$14,1,0))","v":1},{"$f":"IF($I$17>$G$17,3,IF($G$17=$I$17,1,0))","v":1},{"$f":"IF($I$20>$G$20,3,IF($I$20=$G$20,1,0))","v":1},{"$f":"IF($G$23>$I$23,3,IF($I$23=$G$23,1,0))","v":1}]
[null,null,{"$f":"+$E$6","v":"Hvalsø 2"},"-",{"$f":"+$E$8","v":"HIF/8"},null,null,"-"]
[null,null,{"$f":"+$E$7","v":"Hvalsø 3"},"-",{"$f":"+$E$9","v":"Kr. Hyllinge"},null,null,"-"]
[null,null,{"$f":"+$E$8","v":"HIF/8"},"-",{"$f":"+$E$5","v":"Hvalsø 1"},null,null,"-"]
[null,null,{"$f":"+$E$6","v":"Hvalsø 2"},"-",{"$f":"+$E$7","v":"Hvalsø 3"},null,null,"-"]
[null,null,{"$f":"+$E$9","v":"Kr. Hyllinge"},"-",{"$f":"+$E$5","v":"Hvalsø 1"},null,null,"-"]
[]
[null,null,"Der må kun indtastes i de sandfarvede felter"]
[]
[]
[]
[]
[]
["Årgang","Pulje","Kampprogram Hal N"]
[{"$f":"$C$1","v":"Veteraner"},{"$f":"E$3","v":"Veteraner-1"},{"$f":"C14","v":"Kr. Hyllinge"},"-","HIF/8"]
[{"$f":"$C$1","v":"Veteraner"},{"$f":"E$3","v":"Veteraner-1"},"Hvalsø 1","-","Hvalsø 2"]
[{"$f":"$C$1","v":"Veteraner"},"Veteraner-1","Hvalsø 3","-","HIF/8"]
["Veteraner","Veteraner-1","Hvalsø 2","-","Kr. Hyllinge"]
["Veteraner","Veteraner-1","Hvalsø 1","-","Hvalsø 3"]
["Veteraner","Veteraner-1","Hvalsø 2","-","HIF/8"]
["Veteraner","Veteraner-1","Hvalsø 3","-","Kr. Hyllinge"]
["Veteraner","Veteraner-1","HIF/8","-","Hvalsø 1"]
["Veteraner","Veteraner-1","Hvalsø 2","-","Hvalsø 3"]
["Veteraner","Veteraner-1","Kr. Hyllinge","-","Hvalsø 1"]
["Veteraner","Veteraner 3/4","3'er Pulje 1","-","4'er Pulje 1"]
["Veteraner","Veteraner 1/2","1'er Pulje 1","-","2'er Pulje 1"]

{"sheet":"Herrer 4x4","index":5,"n_rows":132,"n_cols":20,"rows_kept":132,"cut":false,"hidden":false,"merged":[[86,6,86,8],[86,12,86,14],[92,6,92,8],[92,12,92,14],[48,2,48,4],[49,6,49,8],[49,12,49,14],[78,6,78,8],[78,12,78,14],[66,2,66,4],[67,6,67,8],[67,12,67,14],[10,2,10,4],[11,6,11,8],[11,12,11,14],[29,2,29,4],[30,6,30,8],[30,12,30,14]]}
[null,null,"Herre",null,"16 Hold"]
[]
[null,null,"Resultat pulje 1",null,"Herre-P1",1]
[null,null,"Indtast holdnavn"]
[null,null,"Hold 1 ","=","Hvalsø 1",null,"Der må kun indtastes i de sandfarvede felter"]
[null,null,"Hold 2","=","FC Lejre 1"]
[null,null,"Hold 3","=","Nutella på geværet"]
[null,null,"Hold 4","=","10. Oktober 2009"]
[null,null,"Hold 5","=","Hold 5"]
[]
[null,null,"PULJE MED 4 HOLD"]
[{"$nulls":6},"Resultat",{"$nulls":4},"Kampe","Målscore",null,null,"Point"]
[null,null,{"$f":"+$E$5","v":"Hvalsø 1"},"-",{"$f":"+$E$6","v":"FC Lejre 1"},null,null,"-",null,null,{"$f":"E5","v":"Hvalsø 1"},{"$f":"IF($G$13<>\"\",1,0)+IF($G$15<>\"\",1,0)+IF($I$17<>\"\",1,0)","v":0},{"$f":"$G$13+$G$15+$I$17","v":0},"-",{"$f":"$I$13+$I$15+$G$17","v":0},{"$f":"IF($G$13<>\"\",$R$13,0)+IF($G$15<>\"\",$S$13,0)+IF($I$17<>\"\",$T$13,0)","v":0},null,{"$f":"IF($G$13>$I$13,3,IF($G$13=$I$13,1,0))","v":1},{"$f":"IF($G$15>$I$15,3,IF($G$15=$I$15,1,0))","v":1},{"$f":"IF($I$17>$G$17,3,IF($I$17=$G$17,1,0))","v":1}]
[null,null,{"$f":"+$E$7","v":"Nutella på geværet"},"-",{"$f":"+$E$8","v":"10. Oktober 2009"},null,null,"-",null,null,{"$f":"E6","v":"FC Lejre 1"},{"$f":"IF($I$13<>\"\",1,0)+IF($G$16<>\"\",1,0)+IF($G$18<>\"\",1,0)","v":0},{"$f":"$I$13+$G$16+$G$18","v":0},"-",{"$f":"$G$13+$I$16+$I$18","v":0},{"$f":"IF($I$13<>\"\",$R$14,0)+IF($G$16<>\"\",$S$14,0)+IF($G$18<>\"\",$T$14,0)","v":0},null,{"$f":"IF($I$13>$G$13,3,IF($G$13=$I$13,1,0))","v":1},{"$f":"IF($G$16>$I$16,3,IF($G$16=$I$16,1,0))","v":1},{"$f":"IF($G$18>$I$18,3,IF($I$18=$G$18,1,0))","v":1}]
[null,null,{"$f":"+$E$5","v":"Hvalsø 1"},"-",{"$f":"+$E$7","v":"Nutella på geværet"},null,null,"-",null,null,{"$f":"E7","v":"Nutella på geværet"},{"$f":"IF($G$14<>\"\",1,0)+IF($I$15<>\"\",1,0)+IF($I$18<>\"\",1,0)","v":0},{"$f":"$G$14+$I$15+$I$18","v":0},"-",{"$f":"$I$14+$G$15+$G$18","v":0},{"$f":"IF($G$14<>\"\",$R$15,0)+IF($I$15<>\"\",$S$15,0)+IF($I$18<>\"\",$T$15,0)","v":0},null,{"$f":"IF($G$14>$I$14,3,IF($G$14=$I$14,1,0))","v":1},{"$f":"IF($I$15>$G$15,3,IF($G$15=$I$15,1,0))","v":1},{"$f":"IF($I$18>$G$18,3,IF($I$18=$G$18,1,0))","v":1}]
[null,null,{"$f":"+$E$6","v":"FC Lejre 1"},"-",{"$f":"+$E$8","v":"10. Oktober 2009"},null,null,"-",null,null,{"$f":"E8","v":"10. Oktober 2009"},{"$f":"IF($I$14<>\"\",1,0)+IF($I$16<>\"\",1,0)+IF($G$17<>\"\",1,0)","v":0},{"$f":"$I$14+$I$16+$G$17","v":0},"-",{"$f":"$G$14+$G$16+$I$17","v":0},{"$f":"IF($I$14<>\"\",$R$16,0)+IF($I$16<>\"\",$S$16,0)+IF($G$17<>\"\",$T$16,0)","v":0},null,{"$f":"IF($I$14>$G$14,3,IF($G$14=$I$14,1,0))","v":1},{"$f":"IF($I$16>$G$16,3,IF($G$16=$I$16,1,0))","v":1},{"$f":"IF($G$17>$I$17,3,IF($I$17=$G$17,1,0))","v":1}]
[null,null,{"$f":"+$E$8","v":"10. Oktober 2009"},"-",{"$f":"+$E$5","v":"Hvalsø 1"},null,null,"-"]
[null,null,{"$f":"+$E$6","v":"FC Lejre 1"},"-",{"$f":"+$E$7","v":"Nutella på geværet"},null,null,"-"]
[]
[null,null,"Der må kun indtastes i de sandfarvede felter"]
[]
[null,null,"Resultat pulje 2",null,"Herre-P2",1]
[null,null,"Indtast holdnavn"]
[null,null,"Hold 1 ","=","Hvalsø 2",null,"Der må kun indtastes i de sandfarvede felter"]
[null,null,"Hold 2","=","FC Lejre 2"]
[null,null,"Hold 3","=","Daddys Group"]
[null,null,"Hold 4","=","Såby Fodbold"]
[null,null,"Hold 5","=","Hold 5"]
[]
[null,null,"PULJE MED 4 HOLD"]
[{"$nulls":6},"Resultat",{"$nulls":4},"Kampe","Målscore",null,null,"Point"]
[null,null,{"$f":"+$E$24","v":"Hvalsø 2"},"-",{"$f":"+$E$25","v":"FC Lejre 2"},null,null,"-",null,null,{"$f":"E24","v":"Hvalsø 2"},{"$f":"IF($G$32<>\"\",1,0)+IF($G$34<>\"\",1,0)+IF($I$36<>\"\",1,0)","v":0},{"$f":"$G$32+$G$34+$I$36","v":0},"-",{"$f":"$I$32+$I$34+$G$36","v":0},{"$f":"IF($G$32<>\"\",$R$32,0)+IF($G$34<>\"\",$S$32,0)+IF($I$36<>\"\",$T$32,0)","v":0},null,{"$f":"IF($G$32>$I$32,3,IF($G$32=$I$32,1,0))","v":1},{"$f":"IF($G$34>$I$34,3,IF($G$34=$I$34,1,0))","v":1},{"$f":"IF($I$36>$G$36,3,IF($I$36=$G$36,1,0))","v":1}]
[null,null,{"$f":"+$E$26","v":"Daddys Group"},"-",{"$f":"+$E$27","v":"Såby Fodbold"},null,null,"-",null,null,{"$f":"E25","v":"FC Lejre 2"},{"$f":"IF($I$32<>\"\",1,0)+IF($G$35<>\"\",1,0)+IF($G$37<>\"\",1,0)","v":0},{"$f":"$I$32+$G$35+$G$37","v":0},"-",{"$f":"$G$32+$I$35+$I$37","v":0},{"$f":"IF($I$32<>\"\",$R$33,0)+IF($G$35<>\"\",$S$33,0)+IF($G$37<>\"\",$T$33,0)","v":0},null,{"$f":"IF($I$32>$G$32,3,IF($G$32=$I$32,1,0))","v":1},{"$f":"IF($G$35>$I$35,3,IF($G$35=$I$35,1,0))","v":1},{"$f":"IF($G$37>$I$37,3,IF($I$37=$G$37,1,0))","v":1}]
[null,null,{"$f":"+$E$24","v":"Hvalsø 2"},"-",{"$f":"+$E$26","v":"Daddys Group"},null,null,"-",null,null,{"$f":"E26","v":"Daddys Group"},{"$f":"IF($G$33<>\"\",1,0)+IF($I$34<>\"\",1,0)+IF($I$37<>\"\",1,0)","v":0},{"$f":"$G$33+$I$34+$I$37","v":0},"-",{"$f":"$I$33+$G$34+$G$37","v":0},{"$f":"IF($G$33<>\"\",$R$34,0)+IF($I$34<>\"\",$S$34,0)+IF($I$37<>\"\",$T$34,0)","v":0},null,{"$f":"IF($G$33>$I$33,3,IF($G$33=$I$33,1,0))","v":1},{"$f":"IF($I$34>$G$34,3,IF($G$34=$I$34,1,0))","v":1},{"$f":"IF($I$37>$G$37,3,IF($I$37=$G$37,1,0))","v":1}]
[null,null,{"$f":"+$E$25","v":"FC Lejre 2"},"-",{"$f":"+$E$27","v":"Såby Fodbold"},null,null,"-",null,null,{"$f":"E27","v":"Såby Fodbold"},{"$f":"IF($I$33<>\"\",1,0)+IF($I$35<>\"\",1,0)+IF($G$36<>\"\",1,0)","v":0},{"$f":"$I$33+$I$35+$G$36","v":0},"-",{"$f":"$G$33+$G$35+$I$36","v":0},{"$f":"IF($I$33<>\"\",$R$35,0)+IF($I$35<>\"\",$S$35,0)+IF($G$36<>\"\",$T$35,0)","v":0},null,{"$f":"IF($I$33>$G$33,3,IF($G$33=$I$33,1,0))","v":1},{"$f":"IF($I$35>$G$35,3,IF($G$35=$I$35,1,0))","v":1},{"$f":"IF($G$36>$I$36,3,IF($I$36=$G$36,1,0))","v":1}]
[null,null,{"$f":"+$E$27","v":"Såby Fodbold"},"-",{"$f":"+$E$24","v":"Hvalsø 2"},null,null,"-"]
[null,null,{"$f":"+$E$25","v":"FC Lejre 2"},"-",{"$f":"+$E$26","v":"Daddys Group"},null,null,"-"]
[]
[null,null,"Der må kun indtastes i de sandfarvede felter"]
[]
[null,null,"Resultat pulje 3",null,"Herre-P3",1]
[null,null,"Indtast holdnavn"]
[null,null,"Hold 1 ","=","Hvalsø 3",null,"Der må kun indtastes i de sandfarvede felter"]
[null,null,"Hold 2","=","Hvalsøs yngste"]
[null,null,"Hold 3","=","Klogehjørnets Diciple"]
[null,null,"Hold 4","=","Kr. Hyllinge"]
[null,null,"Hold 5","=","Hold 5"]
[]
[null,null,"PULJE MED 4 HOLD"]
[{"$nulls":6},"Resultat",{"$nulls":4},"Kampe","Målscore",null,null,"Point"]
[null,null,{"$f":"+$E$43","v":"Hvalsø 3"},"-",{"$f":"+$E$44","v":"Hvalsøs yngste"},null,1,"-",0,null,{"$f":"E43","v":"Hvalsø 3"},{"$f":"IF(G51<>\"\",1,0)+IF(G53<>\"\",1,0)+IF(I55<>\"\",1,0)","v":3},{"$f":"G51+G53+I55","v":4},"-",{"$f":"I51+I53+G55","v":2},{"$f":"IF(G51<>\"\",R51,0)+IF(G53<>\"\",S51,0)+IF(I55<>\"\",T51,0)","v":7},null,{"$f":"IF(G51>I51,3,IF(G51=I51,1,0))","v":3},{"$f":"IF(G53>I53,3,IF(G53=I53,1,0))","v":1},{"$f":"IF(I55>G55,3,IF(I55=G55,1,0))","v":3}]
[null,null,{"$f":"+$E$45","v":"Klogehjørnets Diciple"},"-",{"$f":"+$E$46","v":"Kr. Hyllinge"},null,1,"-",2,null,{"$f":"E44","v":"Hvalsøs yngste"},{"$f":"IF(I51<>\"\",1,0)+IF(G54<>\"\",1,0)+IF(G56<>\"\",1,0)","v":3},{"$f":"I51+G54+G56","v":2},"-",{"$f":"G51+I54+I56","v":5},{"$f":"IF(I51<>\"\",R52,0)+IF(G54<>\"\",S52,0)+IF(G56<>\"\",T52,0)","v":3},null,{"$f":"IF(I51>G51,3,IF(G51=I51,1,0))","v":0},{"$f":"IF(G54>I54,3,IF(G54=I54,1,0))","v":0},{"$f":"IF(G56>I56,3,IF(I56=G56,1,0))","v":3}]
[null,null,{"$f":"+$E$43","v":"Hvalsø 3"},"-",{"$f":"+$E$45","v":"Klogehjørnets Diciple"},null,1,"-",1,null,{"$f":"E45","v":"Klogehjørnets Diciple"},{"$f":"IF(G52<>\"\",1,0)+IF(I53<>\"\",1,0)+IF(I56<>\"\",1,0)","v":3},{"$f":"G52+I53+I56","v":2},"-",{"$f":"I52+G53+G56","v":4},{"$f":"IF(G52<>\"\",R53,0)+IF(I53<>\"\",S53,0)+IF(I56<>\"\",T53,0)","v":1},null,{"$f":"IF(G52>I52,3,IF(G52=I52,1,0))","v":0},{"$f":"IF(I53>G53,3,IF(G53=I53,1,0))","v":1},{"$f":"IF(I56>G56,3,IF(I56=G56,1,0))","v":0}]
[null,null,{"$f":"+$E$44","v":"Hvalsøs yngste"},"-",{"$f":"+$E$46","v":"Kr. Hyllinge"},null,1,"-",4,null,{"$f":"E46","v":"Kr. Hyllinge"},{"$f":"IF(I52<>\"\",1,0)+IF(I54<>\"\",1,0)+IF(G55<>\"\",1,0)","v":3},{"$f":"I52+I54+G55","v":7},"-",{"$f":"G52+G54+I55","v":4},{"$f":"IF(I52<>\"\",R54,0)+IF(I54<>\"\",S54,0)+IF(G55<>\"\",T54,0)","v":6},null,{"$f":"IF(I52>G52,3,IF(G52=I52,1,0))","v":3},{"$f":"IF(I54>G54,3,IF(G54=I54,1,0))","v":3},{"$f":"IF(G55>I55,3,IF(I55=G55,1,0))","v":0}]
[null,null,{"$f":"+$E$46","v":"Kr. Hyllinge"},"-",{"$f":"+$E$43","v":"Hvalsø 3"},null,1,"-",2]
[null,null,{"$f":"+$E$44","v":"Hvalsøs yngste"},"-",{"$f":"+$E$45","v":"Klogehjørnets Diciple"},null,1,"-",0]
[]
[null,null,"Der må kun indtastes i de sandfarvede felter"]
[]
[null,null,"Resultat pulje 4",null,"Herre-P4",1]
[null,null,"Indtast holdnavn"]
[null,null,"Hold 1 ","=","Daniels Helte",null,"Der må kun indtastes i de sandfarvede felter"]
[null,null,"Hold 2","=",93609319]
[null,null,"Hold 3","=","MME Gruppen"]
[null,null,"Hold 4","=","Senior 4"]
[]
[null,null,"PULJE MED 4 HOLD"]
[{"$nulls":6},"Resultat",{"$nulls":4},"Kampe","Målscore",null,null,"Point"]
[null,null,{"$f":"+$E$62","v":"Daniels Helte"},"-",{"$f":"+$E$63","v":93609319},null,null,"-",null,null,{"$f":"E62","v":"Daniels Helte"},{"$f":"IF(G69<>\"\",1,0)+IF(G71<>\"\",1,0)+IF(I73<>\"\",1,0)","v":0},{"$f":"G69+G71+I73","v":0},"-",{"$f":"I69+I71+G73","v":0},{"$f":"IF(G69<>\"\",R69,0)+IF(G71<>\"\",S69,0)+IF(I73<>\"\",T69,0)","v":0},null,{"$f":"IF(G69>I69,3,IF(G69=I69,1,0))","v":1},{"$f":"IF(G71>I71,3,IF(G71=I71,1,0))","v":1},{"$f":"IF(I73>G73,3,IF(I73=G73,1,0))","v":1}]
[null,null,{"$f":"$E$64","v":"MME Gruppen"},"-",{"$f":"+$E$65","v":"Senior 4"},null,null,"-",null,null,{"$f":"E63","v":93609319},{"$f":"IF(I69<>\"\",1,0)+IF(G72<>\"\",1,0)+IF(G74<>\"\",1,0)","v":0},{"$f":"I69+G72+G74","v":0},"-",{"$f":"G69+I72+I74","v":0},{"$f":"IF(I69<>\"\",R70,0)+IF(G72<>\"\",S70,0)+IF(G74<>\"\",T70,0)","v":0},null,{"$f":"IF(I69>G69,3,IF(G69=I69,1,0))","v":1},{"$f":"IF(G72>I72,3,IF(G72=I72,1,0))","v":1},{"$f":"IF(G74>I74,3,IF(I74=G74,1,0))","v":1}]
[null,null,{"$f":"+$E$62","v":"Daniels Helte"},"-",{"$f":"$E$64","v":"MME Gruppen"},null,null,"-",null,null,{"$f":"E64","v":"MME Gruppen"},{"$f":"IF(G70<>\"\",1,0)+IF(I71<>\"\",1,0)+IF(I74<>\"\",1,0)","v":0},{"$f":"G70+I71+I74","v":0},"-",{"$f":"I70+G71+G74","v":0},{"$f":"IF(G70<>\"\",R71,0)+IF(I71<>\"\",S71,0)+IF(I74<>\"\",T71,0)","v":0},null,{"$f":"IF(G70>I70,3,IF(G70=I70,1,0))","v":1},{"$f":"IF(I71>G71,3,IF(G71=I71,1,0))","v":1},{"$f":"IF(I74>G74,3,IF(I74=G74,1,0))","v":1}]
[null,null,{"$f":"+$E$63","v":93609319},"-",{"$f":"+$E$65","v":"Senior 4"},null,null,"-",null,null,{"$f":"E65","v":"Senior 4"},{"$f":"IF(I70<>\"\",1,0)+IF(I72<>\"\",1,0)+IF(G73<>\"\",1,0)","v":0},{"$f":"I70+I72+G73","v":0},"-",{"$f":"G70+G72+I73","v":0},{"$f":"IF(I70<>\"\",R72,0)+IF(I72<>\"\",S72,0)+IF(G73<>\"\",T72,0)","v":0},null,{"$f":"IF(I70>G70,3,IF(G70=I70,1,0))","v":1},{"$f":"IF(I72>G72,3,IF(G72=I72,1,0))","v":1},{"$f":"IF(G73>I73,3,IF(I73=G73,1,0))","v":1}]
[null,null,{"$f":"$E$65","v":"Senior 4"},"-",{"$f":"+$E$62","v":"Daniels Helte"},null,null,"-"]
[null,null,{"$f":"+$E$63","v":93609319},"-",{"$f":"+$E$64","v":"MME Gruppen"},null,null,"-"]
[]
[null,null,"Der må kun indtastes i de sandfarvede felter"]
[]
[null,null,"Kvartfinaler"]
[{"$nulls":6},"Resultat",null,null,null,"Videre"]
[null,null,"1'er P1","-","2'er P4",null,null,"-",null,null,{"$f":"IF(G80=\"\",\"Kvart 1 Vinder\",IF(G80>=I80,C80,E80))","v":"Kvart 1 Vinder"},"K1"]
[null,null,"1'er P4","-","2'er P1",null,null,"-",null,null,{"$f":"IF(G81=\"\",\"Kvart 2 Vinder\",IF(G81>=I81,C81,E81))","v":"Kvart 2 Vinder"},"K2"]
[null,null,"1'er P2","-","2'er P3",{"$nulls":5},{"$f":"IF(G82=\"\",\"Kvart 3 Vinder\",IF(G82>=I82,C82,E82))","v":"Kvart 3 Vinder"},"K3"]
[null,null,"1'er P3","-","2'er P2",null,null,"-",null,null,{"$f":"IF(G83=\"\",\"Kvart 4 Vinder\",IF(G83>=I83,C83,E83))","v":"Kvart 4 Vinder"},"K4"]
[]
[]
[null,null,"Semifinale"]
[{"$nulls":6},"Resultat",null,null,null,"Videre"]
[null,null,{"$f":"+K80","v":"Kvart 1 Vinder"},"-",{"$f":"+K82","v":"Kvart 3 Vinder"},null,null,"-",null,null,{"$f":"IF(G88=\"\",\"Semi 1 Vinder\",IF(G88>=I88,C88,E88))","v":"Semi 1 Vinder"},"S1"]
[null,null,{"$f":"+K81","v":"Kvart 2 Vinder"},"-",{"$f":"+K83","v":"Kvart 4 Vinder"},null,null,"-",null,null,{"$f":"IF(G89=\"\",\"Semi 2 Vinder\",IF(G89>=I89,C89,E89))","v":"Semi 2 Vinder"},"S2"]
[]
[]
[null,null,"Finale"]
[{"$nulls":6},"Resultat",null,null,null,"Vinder"]
[null,null,{"$f":"+K88","v":"Semi 1 Vinder"},"-",{"$f":"+K89","v":"Semi 2 Vinder"},null,null,"-",null,null,{"$f":"IF(G94=\"\",\"\",IF(G94>I94,C94,E94))","v":""},"F1"]
[]
[]
[]
[]
["Årgang","Pulje","Kampprogram Hal A"]
[{"$f":"$C$1","v":"Herre"},{"$f":"E$3","v":"Herre-P1"},{"$f":"C13","v":"Hvalsø 1"},"-","FC Lejre 1"]
[{"$f":"$C$1","v":"Herre"},{"$f":"E$3","v":"Herre-P1"},"Nutella på geværet","-","10. Oktober 2009"]
["Herre",{"$f":"E$60","v":"Herre-P4"},{"$f":"C69","v":"Daniels Helte"},{"$f":"D69","v":"-"},93609319]
["Herre",{"$f":"E$60","v":"Herre-P4"},{"$f":"C70","v":"MME Gruppen"},"-","Senior 4"]
["Herre",{"$f":"E$3","v":"Herre-P1"},{"$f":"C15","v":"Hvalsø 1"},"-","Nutella på geværet"]
["Herre",{"$f":"E$3","v":"Herre-P1"},"FC Lejre 1","-","10. Oktober 2009"]
["Herre",{"$f":"E$60","v":"Herre-P4"},{"$f":"C71","v":"Daniels Helte"},{"$f":"D71","v":"-"},"MME Gruppen"]
["Herre","Herre-P4",{"$f":"C72","v":93609319},"-","Senior 4"]
["Herre",{"$f":"E$3","v":"Herre-P1"},{"$f":"C17","v":"10. Oktober 2009"},"-","Hvalsø 1"]
["Herre",{"$f":"E$3","v":"Herre-P1"},"FC Lejre 1","-","Nutella på geværet"]
["Herre",{"$f":"E$60","v":"Herre-P4"},{"$f":"+C73","v":"Senior 4"},{"$f":"+D73","v":"-"},"Daniels Helte"]
["Herre","Herre-P4",{"$f":"+C74","v":93609319},"-","MME Gruppen"]
["Herre","Herre-K1",{"$f":"+C80","v":"1'er P1"},{"$f":"+D80","v":"-"},"2'er P4"]
["Herre","Herre-K2",{"$f":"+C81","v":"1'er P4"},"-","2'er P1"]
["Herre","Herre-K3",{"$f":"+C82","v":"1'er P2"},"-","2'er P3"]
["Herre","Herre-K4",{"$f":"+C83","v":"1'er P3"},"-","2'er P2"]
["Herre","Herre-S1",{"$f":"+C88","v":"Kvart 1 Vinder"},{"$f":"+D88","v":"-"},"Kvart 3 Vinder"]
["Herre","Herre-S2",{"$f":"+C89","v":"Kvart 2 Vinder"},"-","Kvart 4 Vinder"]
["Herre","Finale",{"$f":"+C94","v":"Semi 1 Vinder"},{"$f":"+D94","v":"-"},"Semi 2 Vinder"]
[]
["Årgang","Pulje","Kampprogram Hal B"]
[{"$f":"$C$1","v":"Herre"},{"$f":"E$22","v":"Herre-P2"},{"$f":"C32","v":"Hvalsø 2"},{"$f":"D32","v":"-"},{"$f":"E32","v":"FC Lejre 2"}]
["Herre",{"$f":"E$41","v":"Herre-P3"},{"$f":"C51","v":"Hvalsø 3"},{"$f":"D51","v":"-"},{"$f":"E51","v":"Hvalsøs yngste"}]
["Herre",{"$f":"E$22","v":"Herre-P2"},{"$f":"C33","v":"Daddys Group"},{"$f":"D33","v":"-"},{"$f":"E33","v":"Såby Fodbold"}]
["Herre",{"$f":"E$41","v":"Herre-P3"},{"$f":"C52","v":"Klogehjørnets Diciple"},{"$f":"D52","v":"-"},{"$f":"E52","v":"Kr. Hyllinge"}]
["Herre",{"$f":"E$22","v":"Herre-P2"},{"$f":"C34","v":"Hvalsø 2"},{"$f":"D34","v":"-"},{"$f":"E34","v":"Daddys Group"}]
["Herre",{"$f":"E$41","v":"Herre-P3"},{"$f":"C53","v":"Hvalsø 3"},{"$f":"D53","v":"-"},{"$f":"E53","v":"Klogehjørnets Diciple"}]
["Herre",{"$f":"E$22","v":"Herre-P2"},{"$f":"C35","v":"FC Lejre 2"},{"$f":"D35","v":"-"},{"$f":"E35","v":"Såby Fodbold"}]
["Herre",{"$f":"E$41","v":"Herre-P3"},{"$f":"C54","v":"Hvalsøs yngste"},{"$f":"D54","v":"-"},{"$f":"E54","v":"Kr. Hyllinge"}]
["Herre",{"$f":"E$22","v":"Herre-P2"},{"$f":"C36","v":"Såby Fodbold"},{"$f":"D36","v":"-"},{"$f":"E36","v":"Hvalsø 2"}]
["Herre",{"$f":"E$41","v":"Herre-P3"},{"$f":"C55","v":"Kr. Hyllinge"},{"$f":"D55","v":"-"},{"$f":"E55","v":"Hvalsø 3"}]
["Herre",{"$f":"E$22","v":"Herre-P2"},{"$f":"C37","v":"FC Lejre 2"},{"$f":"D37","v":"-"},{"$f":"E37","v":"Daddys Group"}]
["Herre",{"$f":"E$41","v":"Herre-P3"},{"$f":"C56","v":"Hvalsøs yngste"},{"$f":"D56","v":"-"},{"$f":"E56","v":"Klogehjørnets Diciple"}]